Information card for entry 7034691
Formula | C12 H15 N2 O4 Re |
Calculated formula | C12 H15 N2 O4 Re |
SMILES | n1(c([n+](cc1)C)C)Cc1ccccc1.[Re](=O)(=O)(=O)[O-] |
Title of publication | Influence of substituents on cation-anion contacts in imidazolium perrhenates. |
Authors of publication | Reich, Robert M.; Cokoja, Mirza; Markovits, Iulius I. E.; Münchmeyer, Christian J; Kaposi, Marlene; Pöthig, Alexander; Herrmann, Wolfgang A.; Kühn, Fritz E |
Journal of publication | Dalton transactions (Cambridge, England : 2003) |
Year of publication | 2015 |
Journal volume | 44 |
Journal issue | 18 |
Pages of publication | 8669 - 8677 |
a | 8.0076 ± 0.0005 Å |
b | 9.478 ± 0.0005 Å |
c | 10.6971 ± 0.0006 Å |
α | 65.571 ± 0.002° |
β | 77.076 ± 0.002° |
γ | 68.508 ± 0.002° |
Cell volume | 685.29 ± 0.07 Å3 |
Cell temperature | 123 K |
Ambient diffraction temperature | 123 K |
Number of distinct elements | 5 |
Space group number | 2 |
Hermann-Mauguin space group symbol | P -1 |
Hall space group symbol | -P 1 |
Residual factor for all reflections | 0.0151 |
Residual factor for significantly intense reflections | 0.015 |
Weighted residual factors for significantly intense reflections | 0.0386 |
Weighted residual factors for all reflections included in the refinement | 0.0387 |
Goodness-of-fit parameter for all reflections included in the refinement | 1.218 |
Diffraction radiation probe | x-ray |
Diffraction radiation wavelength | 0.71073 Å |
Diffraction radiation type | MoKα |