Information card for entry 7034700
Formula | C17 H7 F10 N2 O4 Re |
Calculated formula | C17 H7 F10 N2 O4 Re |
SMILES | Fc1c(C[n+]2cn(cc2)Cc2c(F)c(F)c(F)c(F)c2F)c(F)c(F)c(F)c1F.[Re](=O)(=O)(=O)[O-] |
Title of publication | Influence of substituents on cation-anion contacts in imidazolium perrhenates. |
Authors of publication | Reich, Robert M.; Cokoja, Mirza; Markovits, Iulius I. E.; Münchmeyer, Christian J; Kaposi, Marlene; Pöthig, Alexander; Herrmann, Wolfgang A.; Kühn, Fritz E |
Journal of publication | Dalton transactions (Cambridge, England : 2003) |
Year of publication | 2015 |
Journal volume | 44 |
Journal issue | 18 |
Pages of publication | 8669 - 8677 |
a | 6.5996 ± 0.0002 Å |
b | 12.4519 ± 0.0003 Å |
c | 23.9499 ± 0.0006 Å |
α | 90° |
β | 90° |
γ | 90° |
Cell volume | 1968.14 ± 0.09 Å3 |
Cell temperature | 123 K |
Ambient diffraction temperature | 123 K |
Number of distinct elements | 6 |
Space group number | 19 |
Hermann-Mauguin space group symbol | P 21 21 21 |
Hall space group symbol | P 2ac 2ab |
Residual factor for all reflections | 0.0219 |
Residual factor for significantly intense reflections | 0.0185 |
Weighted residual factors for significantly intense reflections | 0.0351 |
Weighted residual factors for all reflections included in the refinement | 0.0358 |
Goodness-of-fit parameter for all reflections included in the refinement | 1.017 |
Diffraction radiation probe | x-ray |
Diffraction radiation wavelength | 0.71073 Å |
Diffraction radiation type | MoKα |