Information card for entry 7034715
Formula | C42 H22 F6 Fe N10 S2 |
Calculated formula | C42 H22 F6 Fe N10 S2 |
SMILES | C(=N[Fe]12([n]3cccc4c5c(c6ccc[n]1c6c34)[nH]c(n5)c1c(cccc1)C(F)(F)F)(N=C=S)[n]1cccc3c4c(c5ccc[n]2c5c13)[nH]c(n4)c1c(cccc1)C(F)(F)F)=S |
Title of publication | Two-step magnetic switching in a mononuclear iron(ii) complex around room temperature. |
Authors of publication | Yang, Qian; Cheng, Xin; Wang, YeXin; Wang, BingWu; Wang, ZheMing; Gao, Song |
Journal of publication | Dalton transactions (Cambridge, England : 2003) |
Year of publication | 2015 |
Journal volume | 44 |
Journal issue | 19 |
Pages of publication | 8938 - 8941 |
a | 12.9544 ± 0.0008 Å |
b | 10.7221 ± 0.0008 Å |
c | 28.685 ± 0.002 Å |
α | 90° |
β | 90° |
γ | 90° |
Cell volume | 3984.3 ± 0.5 Å3 |
Cell temperature | 420 ± 0.11 K |
Ambient diffraction temperature | 420 ± 0.11 K |
Number of distinct elements | 6 |
Space group number | 60 |
Hermann-Mauguin space group symbol | P b c n |
Hall space group symbol | -P 2n 2ab |
Residual factor for all reflections | 0.1099 |
Residual factor for significantly intense reflections | 0.0627 |
Weighted residual factors for significantly intense reflections | 0.1768 |
Weighted residual factors for all reflections included in the refinement | 0.2127 |
Goodness-of-fit parameter for all reflections included in the refinement | 1.021 |
Diffraction radiation wavelength | 0.7107 Å |
Diffraction radiation type | MoKα |