Information card for entry 7034718
Formula | C27 H47 B F4 N6 O Ru |
Calculated formula | C27 H47 B F4 N6 O Ru |
Title of publication | 16-Electron pentadienyl- and cyclopentadienyl-ruthenium half-sandwich complexes with bis(imidazol-2-imine) ligands and their use in catalytic transfer hydrogenation. |
Authors of publication | Glöge, Thomas; Jess, Kristof; Bannenberg, Thomas; Jones, Peter G.; Langenscheidt-Dabringhausen, Nadine; Salzer, Albrecht; Tamm, Matthias |
Journal of publication | Dalton transactions (Cambridge, England : 2003) |
Year of publication | 2015 |
Journal volume | 44 |
Journal issue | 26 |
Pages of publication | 11717 - 11724 |
a | 8.0534 ± 0.0002 Å |
b | 13.6581 ± 0.0004 Å |
c | 14.1481 ± 0.0004 Å |
α | 100.097 ± 0.002° |
β | 97.841 ± 0.002° |
γ | 96.84 ± 0.002° |
Cell volume | 1501.38 ± 0.07 Å3 |
Cell temperature | 100 ± 2 K |
Ambient diffraction temperature | 100 ± 2 K |
Number of distinct elements | 7 |
Space group number | 2 |
Hermann-Mauguin space group symbol | P -1 |
Hall space group symbol | -P 1 |
Residual factor for all reflections | 0.0466 |
Residual factor for significantly intense reflections | 0.0313 |
Weighted residual factors for significantly intense reflections | 0.0605 |
Weighted residual factors for all reflections included in the refinement | 0.0621 |
Goodness-of-fit parameter for all reflections included in the refinement | 0.885 |
Diffraction radiation wavelength | 0.71073 Å |
Diffraction radiation type | MoKα |