Information card for entry 7034724
Formula | C19 H24 B Cl Cu F4 N5 |
Calculated formula | C19 H24 B Cl Cu F4 N5 |
Title of publication | Catalytic catechol oxidation by copper complexes: development of a structure-activity relationship. |
Authors of publication | Ording-Wenker, Erica C M; Siegler, Maxime A.; Lutz, Martin; Bouwman, Elisabeth |
Journal of publication | Dalton transactions (Cambridge, England : 2003) |
Year of publication | 2015 |
Journal volume | 44 |
Journal issue | 27 |
Pages of publication | 12196 - 12209 |
a | 13.287 ± 0.002 Å |
b | 27.558 ± 0.005 Å |
c | 6.9232 ± 0.0017 Å |
α | 90° |
β | 111.421 ± 0.013° |
γ | 90° |
Cell volume | 2359.9 ± 0.8 Å3 |
Cell temperature | 150 ± 2 K |
Ambient diffraction temperature | 150 ± 2 K |
Number of distinct elements | 7 |
Space group number | 12 |
Hermann-Mauguin space group symbol | C 1 2/m 1 |
Hall space group symbol | -C 2y |
Residual factor for all reflections | 0.0942 |
Residual factor for significantly intense reflections | 0.078 |
Weighted residual factors for significantly intense reflections | 0.2007 |
Weighted residual factors for all reflections included in the refinement | 0.2123 |
Goodness-of-fit parameter for all reflections included in the refinement | 1.151 |
Diffraction radiation wavelength | 0.71073 Å |
Diffraction radiation type | MoKα |