Information card for entry 7034727
Formula | C16 H21 B Cl Cu F4 N3 S |
Calculated formula | C16 H21 B Cl Cu F4 N3 S |
Title of publication | Catalytic catechol oxidation by copper complexes: development of a structure-activity relationship. |
Authors of publication | Ording-Wenker, Erica C M; Siegler, Maxime A.; Lutz, Martin; Bouwman, Elisabeth |
Journal of publication | Dalton transactions (Cambridge, England : 2003) |
Year of publication | 2015 |
Journal volume | 44 |
Journal issue | 27 |
Pages of publication | 12196 - 12209 |
a | 13.4189 ± 0.0004 Å |
b | 12.5086 ± 0.0003 Å |
c | 12.8357 ± 0.0005 Å |
α | 90° |
β | 116.644 ± 0.004° |
γ | 90° |
Cell volume | 1925.71 ± 0.12 Å3 |
Cell temperature | 110 ± 2 K |
Ambient diffraction temperature | 110 ± 2 K |
Number of distinct elements | 8 |
Space group number | 14 |
Hermann-Mauguin space group symbol | P 1 21/c 1 |
Hall space group symbol | -P 2ybc |
Residual factor for all reflections | 0.0455 |
Residual factor for significantly intense reflections | 0.0368 |
Weighted residual factors for significantly intense reflections | 0.0889 |
Weighted residual factors for all reflections included in the refinement | 0.093 |
Goodness-of-fit parameter for all reflections included in the refinement | 1.041 |
Diffraction radiation wavelength | 1.54178 Å |
Diffraction radiation type | CuKα |