Information card for entry 7034742
Formula | C24 H23 Cl Cu F6 N3 P |
Calculated formula | C24 H23 Cl Cu F6 N3 P |
SMILES | [Cu]12([n]3c(C[N]1(Cc1[n]2cccc1)[C@@H](C)c1cccc2c1cccc2)cccc3)Cl.[P](F)(F)(F)(F)(F)[F-] |
Title of publication | Synthesis, characterization, DNA/BSA interactions and anticancer activity of achiral and chiral copper complexes. |
Authors of publication | Zhou, Xue-Quan; Sun, Qian; Jiang, Lin; Li, Si-Tong; Gu, Wen; Tian, Jin-Lei; Liu, Xin; Yan, Shi-Ping |
Journal of publication | Dalton transactions (Cambridge, England : 2003) |
Year of publication | 2015 |
Journal volume | 44 |
Journal issue | 20 |
Pages of publication | 9516 - 9527 |
a | 14.258 ± 0.003 Å |
b | 15.075 ± 0.003 Å |
c | 23.007 ± 0.005 Å |
α | 90° |
β | 90° |
γ | 90° |
Cell volume | 4945.1 ± 1.8 Å3 |
Cell temperature | 113 ± 2 K |
Ambient diffraction temperature | 113 ± 2 K |
Number of distinct elements | 7 |
Space group number | 19 |
Hermann-Mauguin space group symbol | P 21 21 21 |
Hall space group symbol | P 2ac 2ab |
Residual factor for all reflections | 0.0533 |
Residual factor for significantly intense reflections | 0.0485 |
Weighted residual factors for significantly intense reflections | 0.118 |
Weighted residual factors for all reflections included in the refinement | 0.1214 |
Goodness-of-fit parameter for all reflections included in the refinement | 1.026 |
Diffraction radiation wavelength | 0.71073 Å |
Diffraction radiation type | MoKα |