Information card for entry 7034751
Formula | C14 H16 Cl2 N2 Si Zn |
Calculated formula | C14 H16 Cl2 N2 Si Zn |
Title of publication | Construction of helical coordination polymers via flexible conformers of bis(3-pyridyl)cyclotetramethylenesilane: metal(ii) and halogen effects on luminescence, thermolysis and catalysis. |
Authors of publication | Kim, Hyeun; Park, Minwoo; Lee, Haeri; Jung, Ok-Sang |
Journal of publication | Dalton transactions (Cambridge, England : 2003) |
Year of publication | 2015 |
Journal volume | 44 |
Journal issue | 17 |
Pages of publication | 8198 - 8204 |
a | 12.3161 ± 0.0007 Å |
b | 7.8934 ± 0.0004 Å |
c | 16.9833 ± 0.001 Å |
α | 90° |
β | 104.06 ± 0.003° |
γ | 90° |
Cell volume | 1601.58 ± 0.16 Å3 |
Cell temperature | 173 ± 2 K |
Ambient diffraction temperature | 173 ± 2 K |
Number of distinct elements | 6 |
Space group number | 14 |
Hermann-Mauguin space group symbol | P 1 21/n 1 |
Hall space group symbol | -P 2yn |
Residual factor for all reflections | 0.0465 |
Residual factor for significantly intense reflections | 0.0345 |
Weighted residual factors for significantly intense reflections | 0.0731 |
Weighted residual factors for all reflections included in the refinement | 0.0785 |
Goodness-of-fit parameter for all reflections included in the refinement | 1.035 |
Diffraction radiation wavelength | 0.71073 Å |
Diffraction radiation type | MoKα |