Information card for entry 7034753
Formula | C14 H16 Cl2 Hg N2 Si |
Calculated formula | C14 H16 Cl2 Hg N2 Si |
Title of publication | Construction of helical coordination polymers via flexible conformers of bis(3-pyridyl)cyclotetramethylenesilane: metal(ii) and halogen effects on luminescence, thermolysis and catalysis. |
Authors of publication | Kim, Hyeun; Park, Minwoo; Lee, Haeri; Jung, Ok-Sang |
Journal of publication | Dalton transactions (Cambridge, England : 2003) |
Year of publication | 2015 |
Journal volume | 44 |
Journal issue | 17 |
Pages of publication | 8198 - 8204 |
a | 12.5515 ± 0.0003 Å |
b | 8.0518 ± 0.0002 Å |
c | 17.0144 ± 0.0004 Å |
α | 90° |
β | 104.844 ± 0.001° |
γ | 90° |
Cell volume | 1662.13 ± 0.07 Å3 |
Cell temperature | 173 ± 2 K |
Ambient diffraction temperature | 173 ± 2 K |
Number of distinct elements | 6 |
Space group number | 14 |
Hermann-Mauguin space group symbol | P 1 21/n 1 |
Hall space group symbol | -P 2yn |
Residual factor for all reflections | 0.0432 |
Residual factor for significantly intense reflections | 0.0324 |
Weighted residual factors for significantly intense reflections | 0.0803 |
Weighted residual factors for all reflections included in the refinement | 0.0862 |
Goodness-of-fit parameter for all reflections included in the refinement | 1.117 |
Diffraction radiation wavelength | 0.71073 Å |
Diffraction radiation type | MoKα |