Information card for entry 7034759
Formula | C36 H28 Au Cl F10 N4 O5 |
Calculated formula | C36 H28 Au Cl F10 N4 O5 |
SMILES | [Au]1(=C(N(Cc2[n]1cccc2)Cc1ncccc1)Nc1c(C)cccc1C)(c1c(F)c(F)c(F)c(F)c1F)c1c(F)c(F)c(F)c(F)c1F.Cl(=O)(=O)(=O)[O-].O=C(C)C |
Title of publication | The fluxional amine gold(iii) complex as an excellent catalyst and precursor of biologically active acyclic carbenes. |
Authors of publication | Montanel-Pérez, Sara; Herrera, Raquel P.; Laguna, Antonio; Villacampa, M. Dolores; Gimeno, M Concepción |
Journal of publication | Dalton transactions (Cambridge, England : 2003) |
Year of publication | 2015 |
Journal volume | 44 |
Journal issue | 19 |
Pages of publication | 9052 - 9062 |
a | 10.5 ± 0.002 Å |
b | 13.507 ± 0.003 Å |
c | 13.812 ± 0.003 Å |
α | 80.76 ± 0.03° |
β | 69.01 ± 0.03° |
γ | 77.33 ± 0.03° |
Cell volume | 1777.1 ± 0.8 Å3 |
Cell temperature | 100 ± 2 K |
Ambient diffraction temperature | 100 ± 2 K |
Number of distinct elements | 7 |
Space group number | 2 |
Hermann-Mauguin space group symbol | P -1 |
Hall space group symbol | -P 1 |
Residual factor for all reflections | 0.0249 |
Residual factor for significantly intense reflections | 0.0224 |
Weighted residual factors for significantly intense reflections | 0.0522 |
Weighted residual factors for all reflections included in the refinement | 0.0538 |
Goodness-of-fit parameter for all reflections included in the refinement | 1.037 |
Diffraction radiation wavelength | 0.71073 Å |
Diffraction radiation type | MoKα |