Information card for entry 7034779
Formula | C26 H39 Cl3 N2 Sn |
Calculated formula | C26 H39 Cl3 N2 Sn |
Title of publication | Synthesis of chelating diamido Sn(iv) compounds from oxidation of Sn(ii) and directly from Sn(iv) precursors. |
Authors of publication | Mansell, S. M.; Russell, C. A.; Wass, D. F. |
Journal of publication | Dalton transactions (Cambridge, England : 2003) |
Year of publication | 2015 |
Journal volume | 44 |
Journal issue | 21 |
Pages of publication | 9756 - 9765 |
a | 10.2328 ± 0.0009 Å |
b | 15.1239 ± 0.0014 Å |
c | 20.634 ± 0.003 Å |
α | 102.086 ± 0.004° |
β | 100.379 ± 0.004° |
γ | 109.057 ± 0.003° |
Cell volume | 2842.7 ± 0.6 Å3 |
Cell temperature | 100 ± 2 K |
Ambient diffraction temperature | 100 ± 2 K |
Number of distinct elements | 5 |
Space group number | 2 |
Hermann-Mauguin space group symbol | P -1 |
Hall space group symbol | -P 1 |
Residual factor for all reflections | 0.0873 |
Residual factor for significantly intense reflections | 0.049 |
Weighted residual factors for significantly intense reflections | 0.1117 |
Weighted residual factors for all reflections included in the refinement | 0.126 |
Goodness-of-fit parameter for all reflections included in the refinement | 1.007 |
Diffraction radiation wavelength | 0.71073 Å |
Diffraction radiation type | MoKα |