Information card for entry 7034784
Formula | C37 H47 I N2 Si Sn |
Calculated formula | C37 H47 I N2 Si Sn |
SMILES | [Sn]1(I)(N([Si](N1c1c(cccc1C(C)C)C(C)C)(c1ccccc1)c1ccccc1)c1c(cccc1C(C)C)C(C)C)C |
Title of publication | Synthesis of chelating diamido Sn(iv) compounds from oxidation of Sn(ii) and directly from Sn(iv) precursors. |
Authors of publication | Mansell, S. M.; Russell, C. A.; Wass, D. F. |
Journal of publication | Dalton transactions (Cambridge, England : 2003) |
Year of publication | 2015 |
Journal volume | 44 |
Journal issue | 21 |
Pages of publication | 9756 - 9765 |
a | 10.405 ± 0.002 Å |
b | 18.412 ± 0.004 Å |
c | 19.168 ± 0.004 Å |
α | 90° |
β | 102.47 ± 0.03° |
γ | 90° |
Cell volume | 3585.5 ± 1.3 Å3 |
Cell temperature | 100 ± 2 K |
Ambient diffraction temperature | 100 ± 2 K |
Number of distinct elements | 6 |
Space group number | 14 |
Hermann-Mauguin space group symbol | P 1 21/n 1 |
Hall space group symbol | -P 2yn |
Residual factor for all reflections | 0.156 |
Residual factor for significantly intense reflections | 0.0899 |
Weighted residual factors for significantly intense reflections | 0.1823 |
Weighted residual factors for all reflections included in the refinement | 0.2239 |
Goodness-of-fit parameter for all reflections included in the refinement | 1.041 |
Diffraction radiation wavelength | 0.71073 Å |
Diffraction radiation type | MoKα |