Information card for entry 7034790
Formula | C17 H33 Ag3 Mo24 N6 O81 P2 |
Calculated formula | C17 H25 Ag3 Mo24 N6 O81 P2 |
Title of publication | Highly efficient usage of the hydrothermal technique through the one-pot method to construct four Keggin-based compounds containing pendent ligands. |
Authors of publication | Tian, Aixiang; Ning, Yali; Ying, Jun; Zhang, Juwen; Hou, Xue; Li, Tianjiao; Wang, Xiuli |
Journal of publication | Dalton transactions (Cambridge, England : 2003) |
Year of publication | 2015 |
Journal volume | 44 |
Journal issue | 22 |
Pages of publication | 10499 - 10507 |
a | 13.9155 ± 0.0006 Å |
b | 31.8492 ± 0.0013 Å |
c | 21.236 ± 0.0008 Å |
α | 90° |
β | 106.221 ± 0.001° |
γ | 90° |
Cell volume | 9037.1 ± 0.6 Å3 |
Cell temperature | 296 ± 2 K |
Ambient diffraction temperature | 296 ± 2 K |
Number of distinct elements | 7 |
Space group number | 14 |
Hermann-Mauguin space group symbol | P 1 21/n 1 |
Hall space group symbol | -P 2yn |
Residual factor for all reflections | 0.1051 |
Residual factor for significantly intense reflections | 0.0884 |
Weighted residual factors for significantly intense reflections | 0.2264 |
Weighted residual factors for all reflections included in the refinement | 0.237 |
Goodness-of-fit parameter for all reflections included in the refinement | 1.027 |
Diffraction radiation wavelength | 0.71073 Å |
Diffraction radiation type | MoKα |