Information card for entry 7034792
Formula | C36 H36 Ag3 Mo12 N12 O40 P |
Calculated formula | C36 H36 Ag3 Mo12 N12 O40 P |
Title of publication | Highly efficient usage of the hydrothermal technique through the one-pot method to construct four Keggin-based compounds containing pendent ligands. |
Authors of publication | Tian, Aixiang; Ning, Yali; Ying, Jun; Zhang, Juwen; Hou, Xue; Li, Tianjiao; Wang, Xiuli |
Journal of publication | Dalton transactions (Cambridge, England : 2003) |
Year of publication | 2015 |
Journal volume | 44 |
Journal issue | 22 |
Pages of publication | 10499 - 10507 |
a | 11.8729 ± 0.0007 Å |
b | 16.5311 ± 0.001 Å |
c | 19.4313 ± 0.0012 Å |
α | 98.089 ± 0.001° |
β | 107.517 ± 0.001° |
γ | 110.145 ± 0.001° |
Cell volume | 3284.8 ± 0.3 Å3 |
Cell temperature | 296 ± 2 K |
Ambient diffraction temperature | 296 ± 2 K |
Number of distinct elements | 7 |
Space group number | 2 |
Hermann-Mauguin space group symbol | P -1 |
Hall space group symbol | -P 1 |
Residual factor for all reflections | 0.0523 |
Residual factor for significantly intense reflections | 0.0337 |
Weighted residual factors for significantly intense reflections | 0.0694 |
Weighted residual factors for all reflections included in the refinement | 0.0758 |
Goodness-of-fit parameter for all reflections included in the refinement | 1.011 |
Diffraction radiation wavelength | 0.71073 Å |
Diffraction radiation type | MoKα |