Information card for entry 7034798
Formula | C15 H17 F3 Ga N3 O3 |
Calculated formula | C15 H17 F3 Ga N3 O3 |
SMILES | [Ga]12(F)(F)(F)[n]3c(cccc3)c3cccc([n]23)c2cccc[n]12.O.O.O |
Title of publication | Hydrothermal synthesis of Group 13 metal trifluoride complexes with neutral N-donor ligands. |
Authors of publication | Bhalla, Rajiv; Levason, William; Luthra, Sajinder K.; McRobbie, Graeme; Monzittu, Francesco M.; Palmer, Jazmyn; Reid, Gillian; Sanderson, George; Zhang, Wenjian |
Journal of publication | Dalton transactions (Cambridge, England : 2003) |
Year of publication | 2015 |
Journal volume | 44 |
Journal issue | 20 |
Pages of publication | 9569 - 9580 |
a | 10.323 ± 0.005 Å |
b | 9.708 ± 0.005 Å |
c | 16.131 ± 0.005 Å |
α | 90 ± 0.005° |
β | 100.484 ± 0.005° |
γ | 90 ± 0.005° |
Cell volume | 1589.6 ± 1.2 Å3 |
Cell temperature | 100 ± 2 K |
Ambient diffraction temperature | 100 ± 2 K |
Number of distinct elements | 6 |
Space group number | 14 |
Hermann-Mauguin space group symbol | P 1 21/c 1 |
Hall space group symbol | -P 2ybc |
Residual factor for all reflections | 0.0558 |
Residual factor for significantly intense reflections | 0.0371 |
Weighted residual factors for significantly intense reflections | 0.0842 |
Weighted residual factors for all reflections included in the refinement | 0.0887 |
Goodness-of-fit parameter for all reflections included in the refinement | 1.029 |
Diffraction radiation wavelength | 0.71069 Å |
Diffraction radiation type | MoKα |