Information card for entry 7034807
Formula | C25 H27.8 Cu N3 O6.4 |
Calculated formula | C25 H27.8 Cu N3 O6.4 |
Title of publication | Mixed ligand copper(ii) dicarboxylate complexes: the role of co-ligand hydrophobicity in DNA binding, double-strand DNA cleavage, protein binding and cytotoxicity. |
Authors of publication | Loganathan, Rangasamy; Ramakrishnan, Sethu; Ganeshpandian, Mani; Bhuvanesh, Nattamai S. P.; Palaniandavar, Mallayan; Riyasdeen, Anvarbatcha; Akbarsha, Mohamad Abdulkadhar |
Journal of publication | Dalton transactions (Cambridge, England : 2003) |
Year of publication | 2015 |
Journal volume | 44 |
Journal issue | 22 |
Pages of publication | 10210 - 10227 |
a | 25.6146 ± 0.0017 Å |
b | 12.8338 ± 0.0007 Å |
c | 18.1002 ± 0.0012 Å |
α | 90° |
β | 124.05 ± 0.005° |
γ | 90° |
Cell volume | 4930 ± 0.6 Å3 |
Cell temperature | 296 ± 2 K |
Ambient diffraction temperature | 296.15 K |
Number of distinct elements | 5 |
Space group number | 15 |
Hermann-Mauguin space group symbol | C 1 2/c 1 |
Hall space group symbol | -C 2yc |
Residual factor for all reflections | 0.063 |
Residual factor for significantly intense reflections | 0.0478 |
Weighted residual factors for significantly intense reflections | 0.126 |
Weighted residual factors for all reflections included in the refinement | 0.1357 |
Goodness-of-fit parameter for all reflections included in the refinement | 1.078 |
Diffraction radiation wavelength | 0.71073 Å |
Diffraction radiation type | MoKα |