Information card for entry 7034839
Formula | C8 H41 I7 N8 O2 Pb |
Calculated formula | C8 H41 I7 N8 O2 Pb |
Title of publication | A comparison study of aliphatic and aromatic structure directing agents influencing the crystal and electronic structures, and properties of iodoplumbate hybrids: water induced structure conversion and visible light photocatalytic properties. |
Authors of publication | Liu, Guang-Ning; Shi, Jian-Ru; Han, Xiao-Jiang; Zhang, Xiao; Li, Ke; Li, Jie; Zhang, Tao; Liu, Qi-Sheng; Zhang, Zhen-Wei; Li, Cuncheng |
Journal of publication | Dalton transactions (Cambridge, England : 2003) |
Year of publication | 2015 |
Journal volume | 44 |
Journal issue | 28 |
Pages of publication | 12561 - 12575 |
a | 15.3294 ± 0.0003 Å |
b | 9.4774 ± 0.0002 Å |
c | 23.2087 ± 0.0006 Å |
α | 90° |
β | 101.006 ± 0.002° |
γ | 90° |
Cell volume | 3309.81 ± 0.13 Å3 |
Cell temperature | 293 ± 2 K |
Ambient diffraction temperature | 293 ± 2 K |
Number of distinct elements | 6 |
Space group number | 15 |
Hermann-Mauguin space group symbol | C 1 2/c 1 |
Hall space group symbol | -C 2yc |
Residual factor for all reflections | 0.0573 |
Residual factor for significantly intense reflections | 0.0488 |
Weighted residual factors for significantly intense reflections | 0.149 |
Weighted residual factors for all reflections included in the refinement | 0.1553 |
Goodness-of-fit parameter for all reflections included in the refinement | 0.993 |
Diffraction radiation wavelength | 0.71073 Å |
Diffraction radiation type | MoKα |