Information card for entry 7034846
Formula | C20 H14 N12 Pb |
Calculated formula | C20 H14 N12 Pb |
Title of publication | Color tunable and near white-light emission of two solvent-induced 2D lead(ii) coordination networks based on a rigid ligand 1-tetrazole-4-imidazole-benzene. |
Authors of publication | Chen, Jun; Zhang, Qing; Liu, Zhi-Fa; Wang, Shuai-Hua; Xiao, Yu; Li, Rong; Xu, Jian-Gang; Zhao, Ya-Ping; Zheng, Fa-Kun; Guo, Guo-Cong |
Journal of publication | Dalton transactions (Cambridge, England : 2003) |
Year of publication | 2015 |
Journal volume | 44 |
Journal issue | 21 |
Pages of publication | 10089 - 10096 |
a | 13.1322 ± 0.0011 Å |
b | 7.3687 ± 0.0004 Å |
c | 21 ± 0.002 Å |
α | 90° |
β | 106.06 ± 0.005° |
γ | 90° |
Cell volume | 1952.8 ± 0.3 Å3 |
Cell temperature | 293 ± 2 K |
Ambient diffraction temperature | 293 ± 2 K |
Number of distinct elements | 4 |
Space group number | 14 |
Hermann-Mauguin space group symbol | P 1 21/c 1 |
Hall space group symbol | -P 2ybc |
Residual factor for all reflections | 0.0496 |
Residual factor for significantly intense reflections | 0.0417 |
Weighted residual factors for significantly intense reflections | 0.1121 |
Weighted residual factors for all reflections included in the refinement | 0.1276 |
Goodness-of-fit parameter for all reflections included in the refinement | 1.004 |
Diffraction radiation wavelength | 0.71073 Å |
Diffraction radiation type | MoKα |