Information card for entry 7034853
Common name | 2b in manuscript |
Formula | C34 H56 Ni P2 |
Calculated formula | C34 H56 Ni P2 |
SMILES | [Ni]12([P](CC[P]1(C1CCCCC1)C1CCCCC1)(C1CCCCC1)C1CCCCC1)[CH2]=[CH]2c1ccccc1 |
Title of publication | Investigations on the catalytic carboxylation of olefins with CO2 towards α,β-unsaturated carboxylic acid salts: characterization of intermediates and ligands as well as substrate effects. |
Authors of publication | Jevtovikj, Ivana; Manzini, Simone; Hanauer, Matthias; Rominger, Frank; Schaub, Thomas |
Journal of publication | Dalton transactions (Cambridge, England : 2003) |
Year of publication | 2015 |
Journal volume | 44 |
Journal issue | 24 |
Pages of publication | 11083 - 11094 |
a | 10.6643 ± 0.0018 Å |
b | 9.5838 ± 0.0016 Å |
c | 31.345 ± 0.006 Å |
α | 90° |
β | 97.564 ± 0.005° |
γ | 90° |
Cell volume | 3175.7 ± 1 Å3 |
Cell temperature | 200 ± 2 K |
Ambient diffraction temperature | 200 ± 2 K |
Number of distinct elements | 4 |
Space group number | 14 |
Hermann-Mauguin space group symbol | P 1 21/c 1 |
Hall space group symbol | -P 2ybc |
Residual factor for all reflections | 0.0844 |
Residual factor for significantly intense reflections | 0.0584 |
Weighted residual factors for significantly intense reflections | 0.0884 |
Weighted residual factors for all reflections included in the refinement | 0.0993 |
Goodness-of-fit parameter for all reflections included in the refinement | 1.102 |
Diffraction radiation wavelength | 0.71073 Å |
Diffraction radiation type | MoKα |