Information card for entry 7034861
Formula | C31 H45 F3 N2 O3 S Si |
Calculated formula | C31 H45 F3 N2 O3 S Si |
SMILES | [Si](c1n(cc[n+]1c1c(cccc1C(C)C)C(C)C)c1c(cccc1C(C)C)C(C)C)(C)(C)C.S(=O)(=O)([O-])C(F)(F)F |
Title of publication | Frustrated N-heterocyclic carbene-silylium ion Lewis pairs. |
Authors of publication | Silva Valverde, Miguel F.; Theuergarten, Eileen; Bannenberg, Thomas; Freytag, Matthias; Jones, Peter G.; Tamm, Matthias |
Journal of publication | Dalton transactions (Cambridge, England : 2003) |
Year of publication | 2015 |
Journal volume | 44 |
Journal issue | 20 |
Pages of publication | 9400 - 9408 |
a | 9.71654 ± 0.00013 Å |
b | 22.4084 ± 0.0002 Å |
c | 15.65661 ± 0.00018 Å |
α | 90° |
β | 103.018 ± 0.0012° |
γ | 90° |
Cell volume | 3321.34 ± 0.07 Å3 |
Cell temperature | 100 ± 2 K |
Ambient diffraction temperature | 100 ± 2 K |
Number of distinct elements | 7 |
Space group number | 14 |
Hermann-Mauguin space group symbol | P 1 21/n 1 |
Hall space group symbol | -P 2yn |
Residual factor for all reflections | 0.0379 |
Residual factor for significantly intense reflections | 0.0345 |
Weighted residual factors for significantly intense reflections | 0.0866 |
Weighted residual factors for all reflections included in the refinement | 0.0892 |
Goodness-of-fit parameter for all reflections included in the refinement | 1.027 |
Diffraction radiation wavelength | 1.54184 Å |
Diffraction radiation type | CuKα |