Information card for entry 7034870
Formula |
Cu2.2 Se3.69 Sn Te0.31 Zn0.8 |
Calculated formula |
Cu2.19968 Se3.6916 Sn Te0.30924 Zn0.8 |
Title of publication |
Synthesis, crystal structure, and transport properties of Cu2.2Zn0.8SnSe4-xTex (0.1 ≤ x ≤ 0.4). |
Authors of publication |
Dong, Yongkwan; Eckert, Brian; Wang, Hsin; Zeng, Xiaoyu; Tritt, Terry M.; Nolas, George S. |
Journal of publication |
Dalton transactions (Cambridge, England : 2003) |
Year of publication |
2015 |
Journal volume |
44 |
Journal issue |
19 |
Pages of publication |
9014 - 9019 |
a |
5.70846 ± 0.00032 Å |
b |
5.70846 Å |
c |
11.3823 ± 0.0008 Å |
α |
90° |
β |
90° |
γ |
90° |
Cell volume |
370.91 ± 0.03 Å3 |
Number of distinct elements |
5 |
Space group number |
121 |
Hermann-Mauguin space group symbol |
I -4 2 m |
Hall space group symbol |
I -4 2 |
RFsqd |
0.15988 |
Goodness-of-fit parameter for all reflections |
3.95 |
Method of determination |
powder diffraction |
Diffraction radiation probe |
x-ray |
Diffraction radiation wavelength |
1.5406 Å |
Diffraction radiation type |
Kα~1~ |
Yes |
No |
No |