Information card for entry 7034872
Formula |
Cu2.2 Se3.63 Sn Te0.37 Zn0.8 |
Calculated formula |
Cu2.1999 Se3.63316 Sn Te0.36684 Zn0.80014 |
Title of publication |
Synthesis, crystal structure, and transport properties of Cu2.2Zn0.8SnSe4-xTex (0.1 ≤ x ≤ 0.4). |
Authors of publication |
Dong, Yongkwan; Eckert, Brian; Wang, Hsin; Zeng, Xiaoyu; Tritt, Terry M.; Nolas, George S. |
Journal of publication |
Dalton transactions (Cambridge, England : 2003) |
Year of publication |
2015 |
Journal volume |
44 |
Journal issue |
19 |
Pages of publication |
9014 - 9019 |
a |
5.7151 ± 0.0008 Å |
b |
5.7151 Å |
c |
11.3974 ± 0.0021 Å |
α |
90° |
β |
90° |
γ |
90° |
Cell volume |
372.27 ± 0.09 Å3 |
Number of distinct elements |
5 |
Space group number |
121 |
Hermann-Mauguin space group symbol |
I -4 2 m |
Hall space group symbol |
I -4 2 |
RFsqd |
0.11299 |
Goodness-of-fit parameter for all reflections |
4.25 |
Method of determination |
powder diffraction |
Diffraction radiation probe |
x-ray |
Diffraction radiation wavelength |
1.5406 Å |
Diffraction radiation type |
Kα~1~ |
Yes |
No |
No |