Information card for entry 7034875
Formula | C21 H47 O4 P2 Rh Si |
Calculated formula | C21 H47 O4 P2 Rh Si |
Title of publication | Synthesis and structure of rhodium(i) silyl carbonyl complexes: photochemical C-F and C-H bond activation of fluorinated aromatic compounds. |
Authors of publication | Zámostná, Lada; Sander, Stefan; Braun, Thomas; Laubenstein, Reik; Braun, Beatrice; Herrmann, Roy; Kläring, Paul |
Journal of publication | Dalton transactions (Cambridge, England : 2003) |
Year of publication | 2015 |
Journal volume | 44 |
Journal issue | 20 |
Pages of publication | 9450 - 9469 |
a | 18.0682 ± 0.0013 Å |
b | 9.0148 ± 0.0006 Å |
c | 17.3434 ± 0.0013 Å |
α | 90° |
β | 101.737 ± 0.003° |
γ | 90° |
Cell volume | 2765.8 ± 0.3 Å3 |
Cell temperature | 150 ± 2 K |
Ambient diffraction temperature | 150 ± 2 K |
Number of distinct elements | 6 |
Space group number | 14 |
Hermann-Mauguin space group symbol | P 1 21/c 1 |
Hall space group symbol | -P 2ybc |
Residual factor for all reflections | 0.0473 |
Residual factor for significantly intense reflections | 0.0314 |
Weighted residual factors for significantly intense reflections | 0.0642 |
Weighted residual factors for all reflections included in the refinement | 0.0695 |
Goodness-of-fit parameter for all reflections included in the refinement | 1.035 |
Diffraction radiation wavelength | 0.71073 Å |
Diffraction radiation type | MoKα |