Information card for entry 7034896
Formula | C47 H66 N5 O6 Tb |
Calculated formula | C47 H64 N5 O6 Tb |
Title of publication | A macrocyclic tetraamine bearing four phenol groups: a new class of heptadentate ligands to provide an oxygen-sensitive luminescent Tb(iii) complex with an extendable phenol pendant arm. |
Authors of publication | Nakai, Hidetaka; Nonaka, Kyoshiro; Goto, Takahiro; Seo, Juncheol; Matsumoto, Takahiro; Ogo, Seiji |
Journal of publication | Dalton transactions (Cambridge, England : 2003) |
Year of publication | 2015 |
Journal volume | 44 |
Journal issue | 24 |
Pages of publication | 10923 - 10927 |
a | 15.798 ± 0.003 Å |
b | 16.162 ± 0.003 Å |
c | 18.914 ± 0.004 Å |
α | 90° |
β | 105.204 ± 0.003° |
γ | 90° |
Cell volume | 4660.2 ± 1.6 Å3 |
Cell temperature | 103 K |
Ambient diffraction temperature | 103 K |
Number of distinct elements | 5 |
Space group number | 14 |
Hermann-Mauguin space group symbol | P 1 21/n 1 |
Hall space group symbol | -P 2yn |
Residual factor for all reflections | 0.0588 |
Residual factor for significantly intense reflections | 0.0479 |
Weighted residual factors for significantly intense reflections | 0.1123 |
Weighted residual factors for all reflections included in the refinement | 0.1201 |
Goodness-of-fit parameter for all reflections included in the refinement | 1.093 |
Diffraction radiation wavelength | 0.71075 Å |
Diffraction radiation type | MoKα |