Information card for entry 7034899
Common name | [Mn(TpivPP)(2-MeHIm)]0.2(EtOH) |
Formula | C68.4 H71.2 Mn N10 O4.2 |
Calculated formula | C68.4 H71.2 Mn N10 O4.2 |
Title of publication | Geometric and electronic structures of five-coordinate manganese(ii) "picket fence" porphyrin complexes. |
Authors of publication | Yu, Qiang; Liu, Yanhong; Liu, Diansheng; Li, Jianfeng |
Journal of publication | Dalton transactions (Cambridge, England : 2003) |
Year of publication | 2015 |
Journal volume | 44 |
Journal issue | 20 |
Pages of publication | 9382 - 9390 |
a | 18.5139 ± 0.0005 Å |
b | 19.1542 ± 0.0005 Å |
c | 18.2771 ± 0.0004 Å |
α | 90° |
β | 90.646 ± 0.002° |
γ | 90° |
Cell volume | 6481 ± 0.3 Å3 |
Cell temperature | 121 ± 2 K |
Ambient diffraction temperature | 121 ± 2 K |
Number of distinct elements | 5 |
Space group number | 15 |
Hermann-Mauguin space group symbol | C 1 2/c 1 |
Hall space group symbol | -C 2yc |
Residual factor for all reflections | 0.1249 |
Residual factor for significantly intense reflections | 0.0954 |
Weighted residual factors for significantly intense reflections | 0.2758 |
Weighted residual factors for all reflections included in the refinement | 0.3081 |
Goodness-of-fit parameter for all reflections included in the refinement | 1.053 |
Diffraction radiation wavelength | 0.71073 Å |
Diffraction radiation type | MoKα |