Information card for entry 7034919
Formula | C36 H72 B40 Cu2 N4 O8 |
Calculated formula | C36 H72 B40 Cu2 N4 O8 |
Title of publication | Intramolecular hydrogen bonding stabilizes the nuclearity of complexes. A comparative study based on the H-carborane and Me-carborane framework. |
Authors of publication | Fontanet, Mònica; Rodríguez, Montserrat; Fontrodona, Xavier; Romero, Isabel; Viñas, Clara; Teixidor, Francesc |
Journal of publication | Dalton transactions (Cambridge, England : 2003) |
Year of publication | 2015 |
Journal volume | 44 |
Journal issue | 22 |
Pages of publication | 10399 - 10409 |
a | 13.36 ± 0.008 Å |
b | 13.632 ± 0.008 Å |
c | 24.431 ± 0.014 Å |
α | 76.585 ± 0.01° |
β | 75.857 ± 0.009° |
γ | 60.941 ± 0.009° |
Cell volume | 3738 ± 4 Å3 |
Cell temperature | 298 ± 2 K |
Ambient diffraction temperature | 298 ± 2 K |
Number of distinct elements | 6 |
Space group number | 2 |
Hermann-Mauguin space group symbol | P -1 |
Hall space group symbol | -P 1 |
Residual factor for all reflections | 0.0871 |
Residual factor for significantly intense reflections | 0.0609 |
Weighted residual factors for significantly intense reflections | 0.1859 |
Weighted residual factors for all reflections included in the refinement | 0.2023 |
Goodness-of-fit parameter for all reflections included in the refinement | 1.039 |
Diffraction radiation wavelength | 0.71073 Å |
Diffraction radiation type | MoKα |