Information card for entry 7034924
Formula | C24 H60 B40 Cu2 N2 O9 |
Calculated formula | C24 H60 B40 Cu2 N2 O9 |
Title of publication | Intramolecular hydrogen bonding stabilizes the nuclearity of complexes. A comparative study based on the H-carborane and Me-carborane framework. |
Authors of publication | Fontanet, Mònica; Rodríguez, Montserrat; Fontrodona, Xavier; Romero, Isabel; Viñas, Clara; Teixidor, Francesc |
Journal of publication | Dalton transactions (Cambridge, England : 2003) |
Year of publication | 2015 |
Journal volume | 44 |
Journal issue | 22 |
Pages of publication | 10399 - 10409 |
a | 25.36 ± 0.02 Å |
b | 20.832 ± 0.017 Å |
c | 12.538 ± 0.011 Å |
α | 90° |
β | 106.308 ± 0.013° |
γ | 90° |
Cell volume | 6357 ± 9 Å3 |
Cell temperature | 298 ± 2 K |
Ambient diffraction temperature | 298 ± 2 K |
Number of distinct elements | 6 |
Space group number | 15 |
Hermann-Mauguin space group symbol | C 1 2/c 1 |
Hall space group symbol | -C 2yc |
Residual factor for all reflections | 0.0927 |
Residual factor for significantly intense reflections | 0.0699 |
Weighted residual factors for significantly intense reflections | 0.2226 |
Weighted residual factors for all reflections included in the refinement | 0.2408 |
Goodness-of-fit parameter for all reflections included in the refinement | 1.046 |
Diffraction radiation wavelength | 0.71073 Å |
Diffraction radiation type | MoKα |