Information card for entry 7034945
Formula | C79 H47 Cu3 F54 N8 O22 Yb |
Calculated formula | C79 H47 Cu3 F54 N8 O22 Yb |
Title of publication | Slow magnetic relaxation in two-dimensional 3d-4f complexes based on phenyl pyrimidyl substituted nitronyl nitroxide radicals. |
Authors of publication | Zhu, Mei; Wang, Juanjuan; Yang, Meng; Ma, Yue; Li, Licun |
Journal of publication | Dalton transactions (Cambridge, England : 2003) |
Year of publication | 2015 |
Journal volume | 44 |
Journal issue | 21 |
Pages of publication | 9815 - 9822 |
a | 16.504 ± 0.003 Å |
b | 18.636 ± 0.004 Å |
c | 37.36 ± 0.01 Å |
α | 90° |
β | 114.11 ± 0.03° |
γ | 90° |
Cell volume | 10488 ± 5 Å3 |
Cell temperature | 113 ± 2 K |
Ambient diffraction temperature | 113 ± 2 K |
Number of distinct elements | 7 |
Space group number | 14 |
Hermann-Mauguin space group symbol | P 1 21/c 1 |
Hall space group symbol | -P 2ybc |
Residual factor for all reflections | 0.1321 |
Residual factor for significantly intense reflections | 0.0826 |
Weighted residual factors for significantly intense reflections | 0.1888 |
Weighted residual factors for all reflections included in the refinement | 0.2235 |
Goodness-of-fit parameter for all reflections included in the refinement | 1.02 |
Diffraction radiation wavelength | 0.71073 Å |
Diffraction radiation type | MoKα |