Information card for entry 7034973
Formula | C14.93 H23.7 Cl Cu N5 O1.92 S |
Calculated formula | C14.925 H23.7 Cl Cu N5 O1.925 S |
Title of publication | Strong effect of copper(ii) coordination on antiproliferative activity of thiosemicarbazone-piperazine and thiosemicarbazone-morpholine hybrids. |
Authors of publication | Bacher, Felix; Dömötör, Orsolya; Chugunova, Anastasia; Nagy, Nóra V; Filipović, Lana; Radulović, Siniša; Enyedy, Éva A; Arion, Vladimir B. |
Journal of publication | Dalton transactions (Cambridge, England : 2003) |
Year of publication | 2015 |
Journal volume | 44 |
Journal issue | 19 |
Pages of publication | 9071 - 9090 |
a | 9.8676 ± 0.0007 Å |
b | 12.0982 ± 0.0008 Å |
c | 16.606 ± 0.001 Å |
α | 86.45 ± 0.003° |
β | 74.015 ± 0.003° |
γ | 77.176 ± 0.003° |
Cell volume | 1858.2 ± 0.2 Å3 |
Cell temperature | 100 ± 2 K |
Ambient diffraction temperature | 100 ± 2 K |
Number of distinct elements | 7 |
Space group number | 2 |
Hermann-Mauguin space group symbol | P -1 |
Hall space group symbol | -P 1 |
Residual factor for all reflections | 0.0285 |
Residual factor for significantly intense reflections | 0.0279 |
Weighted residual factors for significantly intense reflections | 0.068 |
Weighted residual factors for all reflections included in the refinement | 0.0683 |
Goodness-of-fit parameter for all reflections included in the refinement | 1.095 |
Diffraction radiation wavelength | 0.71073 Å |
Diffraction radiation type | MoKα |