Information card for entry 7034980
Formula | C24 H22 Br4 N4 O12 Zn |
Calculated formula | C24 H22 Br4 N4 O12 Zn |
Title of publication | Exceptional sensitivity to the synthetic approach and halogen substituent for Zn(ii) coordination assemblies with 5-halonicotinic acids. |
Authors of publication | Li, Cheng-Peng; Chen, Jing; Mu, Yu-Hai; Du, Miao |
Journal of publication | Dalton transactions (Cambridge, England : 2003) |
Year of publication | 2015 |
Journal volume | 44 |
Journal issue | 24 |
Pages of publication | 11109 - 11118 |
a | 15.3861 ± 0.0015 Å |
b | 6.8845 ± 0.0007 Å |
c | 29.387 ± 0.003 Å |
α | 90° |
β | 90.112 ± 0.002° |
γ | 90° |
Cell volume | 3112.8 ± 0.5 Å3 |
Cell temperature | 296 ± 2 K |
Ambient diffraction temperature | 296 ± 2 K |
Number of distinct elements | 6 |
Space group number | 13 |
Hermann-Mauguin space group symbol | P 1 2/c 1 |
Hall space group symbol | -P 2yc |
Residual factor for all reflections | 0.1012 |
Residual factor for significantly intense reflections | 0.0431 |
Weighted residual factors for significantly intense reflections | 0.091 |
Weighted residual factors for all reflections included in the refinement | 0.1086 |
Goodness-of-fit parameter for all reflections included in the refinement | 1.01 |
Diffraction radiation wavelength | 0.71073 Å |
Diffraction radiation type | MoKα |