Information card for entry 7034986
Formula | C26 H16 N2 O4 W |
Calculated formula | C26 H16 N2 O4 W |
SMILES | [W]1([n]2c(cc(cc2c2[n]1cccc2)c1ccccc1)c1ccccc1)(C#[O])(C#[O])(C#[O])C#[O] |
Title of publication | 2-(2'-Pyridyl)-4,6-diphenylphosphinine versus 2-(2'-pyridyl)-4,6-diphenylpyridine: synthesis and characterization of novel Cr(0), Mo(0) and W(0) carbonyl complexes containing chelating P,N and N,N ligands. |
Authors of publication | de Krom, Iris; Lutz, Martin; Müller, Christian |
Journal of publication | Dalton transactions (Cambridge, England : 2003) |
Year of publication | 2015 |
Journal volume | 44 |
Journal issue | 22 |
Pages of publication | 10304 - 10314 |
a | 8.0777 ± 0.0002 Å |
b | 15.6562 ± 0.0004 Å |
c | 18.117 ± 0.0004 Å |
α | 90° |
β | 110.058 ± 0.001° |
γ | 90° |
Cell volume | 2152.22 ± 0.09 Å3 |
Cell temperature | 150 ± 2 K |
Ambient diffraction temperature | 150 ± 2 K |
Number of distinct elements | 5 |
Space group number | 14 |
Hermann-Mauguin space group symbol | P 1 21/c 1 |
Hall space group symbol | -P 2ybc |
Residual factor for all reflections | 0.0129 |
Residual factor for significantly intense reflections | 0.0114 |
Weighted residual factors for significantly intense reflections | 0.0265 |
Weighted residual factors for all reflections included in the refinement | 0.0268 |
Goodness-of-fit parameter for all reflections included in the refinement | 1.041 |
Diffraction radiation wavelength | 0.71073 Å |
Diffraction radiation type | MoKα |