Information card for entry 7034988
Formula | C3 H7 Cl6 N O2 W |
Calculated formula | C3 H7 Cl6 N O2 W |
SMILES | C(=O)(C[NH2+]C)Cl.Cl[W](Cl)(Cl)(Cl)(Cl)=O |
Title of publication | The chlorinating behaviour of WCl6 towards α-aminoacids. |
Authors of publication | Bortoluzzi, Marco; Marchetti, Fabio; Murrali, Maria Grazia; Pampaloni, Guido; Zacchini, Stefano |
Journal of publication | Dalton transactions (Cambridge, England : 2003) |
Year of publication | 2015 |
Journal volume | 44 |
Journal issue | 18 |
Pages of publication | 8729 - 8738 |
a | 11.0913 ± 0.0014 Å |
b | 9.9771 ± 0.0013 Å |
c | 11.5383 ± 0.0015 Å |
α | 90° |
β | 105.23 ± 0.002° |
γ | 90° |
Cell volume | 1232 ± 0.3 Å3 |
Cell temperature | 100 ± 2 K |
Ambient diffraction temperature | 100 ± 2 K |
Number of distinct elements | 6 |
Space group number | 14 |
Hermann-Mauguin space group symbol | P 1 21/c 1 |
Hall space group symbol | -P 2ybc |
Residual factor for all reflections | 0.0347 |
Residual factor for significantly intense reflections | 0.0276 |
Weighted residual factors for significantly intense reflections | 0.0609 |
Weighted residual factors for all reflections included in the refinement | 0.0635 |
Goodness-of-fit parameter for all reflections included in the refinement | 1.003 |
Diffraction radiation wavelength | 0.71073 Å |
Diffraction radiation type | MoKα |