Information card for entry 7034991
Common name | Fe-pic-Pt(CN)4-LS |
Formula | C16 H16 Fe N8 Pt |
Calculated formula | C16 H16 Fe N8 Pt |
Title of publication | Spin crossover behaviour in one-dimensional Fe(II) compounds based on the [M(CN)4](2-) (M = Pd, Pt) units. |
Authors of publication | Zhang, Shao-Liang; Zhao, Xin-Hua; Wang, Yuan-Min; Shao, Dong; Wang, Xin-Yi |
Journal of publication | Dalton transactions (Cambridge, England : 2003) |
Year of publication | 2015 |
Journal volume | 44 |
Journal issue | 20 |
Pages of publication | 9682 - 9690 |
a | 7.8428 ± 0.0006 Å |
b | 15.2262 ± 0.0012 Å |
c | 8.4043 ± 0.0007 Å |
α | 90° |
β | 103.367 ± 0.001° |
γ | 90° |
Cell volume | 976.42 ± 0.13 Å3 |
Cell temperature | 120 ± 2 K |
Ambient diffraction temperature | 120 ± 2 K |
Number of distinct elements | 5 |
Space group number | 11 |
Hermann-Mauguin space group symbol | P 1 21/m 1 |
Hall space group symbol | -P 2yb |
Residual factor for all reflections | 0.0299 |
Residual factor for significantly intense reflections | 0.0264 |
Weighted residual factors for significantly intense reflections | 0.0769 |
Weighted residual factors for all reflections included in the refinement | 0.0952 |
Goodness-of-fit parameter for all reflections included in the refinement | 1.226 |
Diffraction radiation wavelength | 0.71073 Å |
Diffraction radiation type | MoKα |