Information card for entry 7034998
Formula | C98 H146 Gd2 O9 |
Calculated formula | C98 H146 Gd2 O9 |
Title of publication | Carbon bridged triphenolate lanthanide complexes: synthesis, characterization, DFT studies and catalytic activities for isoprene polymerization. |
Authors of publication | Zhang, Min; Liang, Zhenhua; Ling, Jun; Ni, Xufeng; Shen, Zhiquan |
Journal of publication | Dalton transactions (Cambridge, England : 2003) |
Year of publication | 2015 |
Journal volume | 44 |
Journal issue | 24 |
Pages of publication | 11182 - 11190 |
a | 50.4714 ± 0.0011 Å |
b | 17.9307 ± 0.0005 Å |
c | 29.1703 ± 0.0006 Å |
α | 90° |
β | 112.425 ± 0.003° |
γ | 90° |
Cell volume | 24402.5 ± 1.1 Å3 |
Cell temperature | 140 ± 2 K |
Ambient diffraction temperature | 140 ± 2 K |
Number of distinct elements | 4 |
Space group number | 15 |
Hermann-Mauguin space group symbol | C 1 2/c 1 |
Hall space group symbol | -C 2yc |
Residual factor for all reflections | 0.0646 |
Residual factor for significantly intense reflections | 0.0505 |
Weighted residual factors for significantly intense reflections | 0.1492 |
Weighted residual factors for all reflections included in the refinement | 0.1582 |
Goodness-of-fit parameter for all reflections included in the refinement | 1.074 |
Diffraction radiation wavelength | 0.71073 Å |
Diffraction radiation type | MoKα |