Information card for entry 7035004
Formula | C38 H46 Dy2 N8 O14 |
Calculated formula | C38 H46 Dy2 N8 O14 |
SMILES | N(C=[O][Dy]1234([O]=N(=O)O4)([N](=Cc4ccccc4O3)c3c(cccc3)[O]1[Dy]134([N](=Cc5ccccc5O3)c3c(cccc3)[O]21)(ON(=[O]4)=O)([O]=CN(C)C)[O]=CN(C)C)[O]=CN(C)C)(C)C |
Title of publication | A family of dinuclear lanthanide(iii) complexes from the use of a tridentate Schiff base. |
Authors of publication | Anastasiadis, Nikolaos C.; Kalofolias, Dimitris A.; Philippidis, Aggelos; Tzani, Sofia; Raptopoulou, Catherine P.; Psycharis, Vassilis; Milios, Constantinos J.; Escuer, Albert; Perlepes, Spyros P. |
Journal of publication | Dalton transactions (Cambridge, England : 2003) |
Year of publication | 2015 |
Journal volume | 44 |
Journal issue | 22 |
Pages of publication | 10200 - 10209 |
a | 12.3132 ± 0.0002 Å |
b | 14.0547 ± 0.0002 Å |
c | 12.6042 ± 0.0002 Å |
α | 90° |
β | 91.412 ± 0.001° |
γ | 90° |
Cell volume | 2180.6 ± 0.06 Å3 |
Cell temperature | 160 ± 2 K |
Ambient diffraction temperature | 160 ± 2 K |
Number of distinct elements | 5 |
Space group number | 14 |
Hermann-Mauguin space group symbol | P 1 21/n 1 |
Hall space group symbol | -P 2yn |
Residual factor for all reflections | 0.0375 |
Residual factor for significantly intense reflections | 0.0364 |
Weighted residual factors for significantly intense reflections | 0.0973 |
Weighted residual factors for all reflections included in the refinement | 0.0988 |
Goodness-of-fit parameter for all reflections included in the refinement | 1.048 |
Diffraction radiation wavelength | 1.54178 Å |
Diffraction radiation type | CuKα |