Information card for entry 7035025
Formula | C120 Cl8 Co Mn4 N7 O70 Si2 W18 |
Calculated formula | C120 Cl8 Co Mn4 N7 O70 Si2 W18 |
Title of publication | A cascade approach to hetero-pentanuclear manganese-oxide clusters in polyoxometalates and their single-molecule magnet properties. |
Authors of publication | Suzuki, Kosuke; Sato, Rinta; Minato, Takuo; Shinoe, Masahiro; Yamaguchi, Kazuya; Mizuno, Noritaka |
Journal of publication | Dalton transactions (Cambridge, England : 2003) |
Year of publication | 2015 |
Journal volume | 44 |
Journal issue | 32 |
Pages of publication | 14220 - 14226 |
a | 14.3467 ± 0.0001 Å |
b | 20.2068 ± 0.0001 Å |
c | 34.2447 ± 0.0003 Å |
α | 103.63 ± 0.0005° |
β | 97.2188 ± 0.0004° |
γ | 92.9884 ± 0.0006° |
Cell volume | 9537.06 ± 0.12 Å3 |
Cell temperature | 123 ± 2 K |
Ambient diffraction temperature | 123 ± 2 K |
Number of distinct elements | 8 |
Space group number | 2 |
Hermann-Mauguin space group symbol | P -1 |
Hall space group symbol | -P 1 |
Residual factor for all reflections | 0.057 |
Residual factor for significantly intense reflections | 0.0464 |
Weighted residual factors for significantly intense reflections | 0.1099 |
Weighted residual factors for all reflections included in the refinement | 0.1152 |
Goodness-of-fit parameter for all reflections included in the refinement | 1.015 |
Diffraction radiation wavelength | 0.71069 Å |
Diffraction radiation type | MoKα |