Information card for entry 7035027
Formula | C120 Cl8 Cu Mn4 N7 O70 Si2 W18 |
Calculated formula | C120 Cl8 Cu Mn4 N7 O70 Si2 W18 |
Title of publication | A cascade approach to hetero-pentanuclear manganese-oxide clusters in polyoxometalates and their single-molecule magnet properties. |
Authors of publication | Suzuki, Kosuke; Sato, Rinta; Minato, Takuo; Shinoe, Masahiro; Yamaguchi, Kazuya; Mizuno, Noritaka |
Journal of publication | Dalton transactions (Cambridge, England : 2003) |
Year of publication | 2015 |
Journal volume | 44 |
Journal issue | 32 |
Pages of publication | 14220 - 14226 |
a | 14.3601 ± 0.0001 Å |
b | 20.2319 ± 0.0002 Å |
c | 34.27 ± 0.0003 Å |
α | 103.541 ± 0.0006° |
β | 97.3195 ± 0.0004° |
γ | 92.9779 ± 0.0004° |
Cell volume | 9566.28 ± 0.15 Å3 |
Cell temperature | 113 ± 2 K |
Ambient diffraction temperature | 113 ± 2 K |
Number of distinct elements | 8 |
Space group number | 2 |
Hermann-Mauguin space group symbol | P -1 |
Hall space group symbol | -P 1 |
Residual factor for all reflections | 0.0743 |
Residual factor for significantly intense reflections | 0.0585 |
Weighted residual factors for significantly intense reflections | 0.1735 |
Weighted residual factors for all reflections included in the refinement | 0.2015 |
Goodness-of-fit parameter for all reflections included in the refinement | 1.101 |
Diffraction radiation wavelength | 0.71069 Å |
Diffraction radiation type | MoKα |