Information card for entry 7035040
Formula | C47 H68 Al2 Cr2 N6 |
Calculated formula | C46 H68 Al2 Cr2 N6 |
Title of publication | A chromium precursor for the Phillips ethylene trimerization catalyst: (2-ethylhexanoate)2CrOH. |
Authors of publication | Jeon, Jong Yeob; Park, Dong Sik; Lee, Dong Hwan; Eo, Seong Chan; Park, Seong Yeon; Jeong, Myoung Sun; Kang, Yi Young; Lee, Junseong; Lee, Bun Yeoul |
Journal of publication | Dalton transactions (Cambridge, England : 2003) |
Year of publication | 2015 |
Journal volume | 44 |
Journal issue | 24 |
Pages of publication | 11004 - 11012 |
a | 14.6 ± 0.0003 Å |
b | 12.677 ± 0.0003 Å |
c | 13.274 ± 0.0002 Å |
α | 90° |
β | 108.396 ± 0.002° |
γ | 90° |
Cell volume | 2331.26 ± 0.09 Å3 |
Cell temperature | 100 ± 2 K |
Ambient diffraction temperature | 100 ± 2 K |
Number of distinct elements | 5 |
Space group number | 12 |
Hermann-Mauguin space group symbol | C 1 2/m 1 |
Hall space group symbol | -C 2y |
Residual factor for all reflections | 0.0666 |
Residual factor for significantly intense reflections | 0.0428 |
Weighted residual factors for significantly intense reflections | 0.0985 |
Weighted residual factors for all reflections included in the refinement | 0.1083 |
Goodness-of-fit parameter for all reflections included in the refinement | 1.073 |
Diffraction radiation wavelength | 0.71073 Å |
Diffraction radiation type | MoKα |