Information card for entry 7035043
Formula | C12 H16 Cu Mo4 N4 O18 |
Calculated formula | C12 H16 Cu Mo4 N4 O18 |
Title of publication | Two novel POM-based inorganic-organic hybrid compounds: synthesis, structures, magnetic properties, photodegradation and selective absorption of organic dyes. |
Authors of publication | Dui, Xue-Jing; Yang, Wen-Bin; Wu, Xiao-Yuan; Kuang, Xiaofei; Liao, Jian-Zhen; Yu, Rongmin; Lu, Can-Zhong |
Journal of publication | Dalton transactions (Cambridge, England : 2003) |
Year of publication | 2015 |
Journal volume | 44 |
Journal issue | 20 |
Pages of publication | 9496 - 9505 |
a | 8.252 ± 0.006 Å |
b | 9.073 ± 0.006 Å |
c | 16.414 ± 0.011 Å |
α | 88.681 ± 0.009° |
β | 80.237 ± 0.009° |
γ | 70.809 ± 0.008° |
Cell volume | 1143.1 ± 1.4 Å3 |
Cell temperature | 173 ± 2 K |
Ambient diffraction temperature | 173 ± 2 K |
Number of distinct elements | 6 |
Space group number | 2 |
Hermann-Mauguin space group symbol | P -1 |
Hall space group symbol | -P 1 |
Residual factor for all reflections | 0.0774 |
Residual factor for significantly intense reflections | 0.071 |
Weighted residual factors for significantly intense reflections | 0.2451 |
Weighted residual factors for all reflections included in the refinement | 0.2492 |
Goodness-of-fit parameter for all reflections included in the refinement | 1.092 |
Diffraction radiation wavelength | 0.71073 Å |
Diffraction radiation type | MoKα |