Information card for entry 7035047
Chemical name | C-3 |
Formula | C20 H18 Cl F N2 O Pt |
Calculated formula | C20 H18 Cl F N2 O Pt |
SMILES | [Pt]1([N](=Cc2c(O1)ccc(c2)C)c1ccc(F)cc1)(Cl)[n]1ccc(cc1)C |
Title of publication | Efficient one-pot synthesis of trans-Pt(ii)(salicylaldimine)(4-picoline)Cl complexes: effective agents for enhanced expression of p53 tumor suppressor genes. |
Authors of publication | Rahman, Faiz-Ur; Ali, Amjad; Guo, Rong; Wang, Wei-Kun; Wang, Hui; Li, Zhan-Ting; Lin, Yuejian; Zhang, Dan-Wei |
Journal of publication | Dalton transactions (Cambridge, England : 2003) |
Year of publication | 2015 |
Journal volume | 44 |
Journal issue | 21 |
Pages of publication | 9872 - 9880 |
a | 7.961 ± 0.003 Å |
b | 10.42 ± 0.004 Å |
c | 12.674 ± 0.005 Å |
α | 84.941 ± 0.005° |
β | 74.687 ± 0.005° |
γ | 72.304 ± 0.005° |
Cell volume | 966 ± 0.6 Å3 |
Cell temperature | 293 ± 2 K |
Ambient diffraction temperature | 293 ± 2 K |
Number of distinct elements | 7 |
Space group number | 2 |
Hermann-Mauguin space group symbol | P -1 |
Hall space group symbol | -P 1 |
Residual factor for all reflections | 0.0655 |
Residual factor for significantly intense reflections | 0.058 |
Weighted residual factors for significantly intense reflections | 0.1699 |
Weighted residual factors for all reflections included in the refinement | 0.1736 |
Goodness-of-fit parameter for all reflections included in the refinement | 1.094 |
Diffraction radiation wavelength | 0.71073 Å |
Diffraction radiation type | MoKα |