Information card for entry 7035068
Formula | C12 H8 Cu N2 O6 |
Calculated formula | C12 H8 Cu N2 O6 |
SMILES | [Cu]12([O]=n3c(cccc3)C(=O)O1)[O]=n1c(cccc1)C(=O)O2 |
Title of publication | Methylresorcinarene: a reaction vessel to control the coordination geometry of copper(ii) in pyridine N-oxide copper(ii) complexes. |
Authors of publication | Beyeh, Ngong Kodiah; Puttreddy, Rakesh |
Journal of publication | Dalton transactions (Cambridge, England : 2003) |
Year of publication | 2015 |
Journal volume | 44 |
Journal issue | 21 |
Pages of publication | 9881 - 9886 |
a | 3.641 ± 0.0006 Å |
b | 12.6301 ± 0.0017 Å |
c | 12.1194 ± 0.0013 Å |
α | 90° |
β | 94.057 ± 0.013° |
γ | 90° |
Cell volume | 555.93 ± 0.13 Å3 |
Cell temperature | 123 ± 0.1 K |
Ambient diffraction temperature | 123 ± 0.1 K |
Number of distinct elements | 5 |
Space group number | 14 |
Hermann-Mauguin space group symbol | P 1 21/c 1 |
Hall space group symbol | -P 2ybc |
Residual factor for all reflections | 0.1056 |
Residual factor for significantly intense reflections | 0.0826 |
Weighted residual factors for significantly intense reflections | 0.205 |
Weighted residual factors for all reflections included in the refinement | 0.2401 |
Goodness-of-fit parameter for all reflections included in the refinement | 1.077 |
Diffraction radiation probe | x-ray |
Diffraction radiation wavelength | 1.54184 Å |
Diffraction radiation type | CuKα |