Information card for entry 7035071
Formula | C24 H19 Cd N2 O4 |
Calculated formula | C24 H19 Cd N2 O4 |
Title of publication | Three new luminescent Cd(ii)-MOFs by regulating the tetracarboxylate and auxiliary co-ligands, displaying high sensitivity for Fe(3+) in aqueous solution. |
Authors of publication | Wu, Yunlong; Yang, Guo-Ping; Zhou, Xiang; Li, Jiang; Ning, Yan; Wang, Yao-Yu |
Journal of publication | Dalton transactions (Cambridge, England : 2003) |
Year of publication | 2015 |
Journal volume | 44 |
Journal issue | 22 |
Pages of publication | 10385 - 10391 |
a | 11.3642 ± 0.0013 Å |
b | 10.8066 ± 0.0012 Å |
c | 17.0884 ± 0.0019 Å |
α | 90° |
β | 99.153 ± 0.002° |
γ | 90° |
Cell volume | 2071.9 ± 0.4 Å3 |
Cell temperature | 296 ± 2 K |
Ambient diffraction temperature | 296 ± 2 K |
Number of distinct elements | 5 |
Space group number | 14 |
Hermann-Mauguin space group symbol | P 1 21/c 1 |
Hall space group symbol | -P 2ybc |
Residual factor for all reflections | 0.0524 |
Residual factor for significantly intense reflections | 0.0351 |
Weighted residual factors for significantly intense reflections | 0.0827 |
Weighted residual factors for all reflections included in the refinement | 0.1313 |
Goodness-of-fit parameter for all reflections included in the refinement | 1.039 |
Diffraction radiation wavelength | 0.71073 Å |
Diffraction radiation type | MoKα |