Information card for entry 7035077
Formula | C28 H39 F6 N4 O8 Rh S4 |
Calculated formula | C28 H35 F6 N4 O8 Rh S4 |
Title of publication | Synthesis of a new type of alkene metal complex using face-capping thione-alkene ligands. |
Authors of publication | Zhang, Long; Yan, Tao; Han, Ying-Feng; Hahn, F. Ekkehardt; Jin, Guo-Xin |
Journal of publication | Dalton transactions (Cambridge, England : 2003) |
Year of publication | 2015 |
Journal volume | 44 |
Journal issue | 19 |
Pages of publication | 8797 - 8800 |
a | 11.339 ± 0.0015 Å |
b | 13.3112 ± 0.0018 Å |
c | 14.488 ± 0.003 Å |
α | 105.937 ± 0.003° |
β | 107.966 ± 0.003° |
γ | 106.131 ± 0.002° |
Cell volume | 1836.4 ± 0.5 Å3 |
Cell temperature | 173 ± 2 K |
Ambient diffraction temperature | 173 ± 2 K |
Number of distinct elements | 7 |
Space group number | 2 |
Hermann-Mauguin space group symbol | P -1 |
Hall space group symbol | -P 1 |
Residual factor for all reflections | 0.0731 |
Residual factor for significantly intense reflections | 0.0459 |
Weighted residual factors for significantly intense reflections | 0.1057 |
Weighted residual factors for all reflections included in the refinement | 0.142 |
Goodness-of-fit parameter for all reflections included in the refinement | 1.066 |
Diffraction radiation wavelength | 0.71073 Å |
Diffraction radiation type | MoKα |