Information card for entry 7035083
Formula | C28 H28 Co2 N16 |
Calculated formula | C28 H28 Co2 N16 |
Title of publication | 4-Substituent pyridine directed cobalt(ii) azides: solvothermal synthesis, structure, and magnetic properties. |
Authors of publication | Zhao, Jiong-Peng; Zhao, Cui; Song, Wei-Chao; Wang, Lei; Xie, Yabo; Li, Jian-Rong; Bu, Xian-He |
Journal of publication | Dalton transactions (Cambridge, England : 2003) |
Year of publication | 2015 |
Journal volume | 44 |
Journal issue | 22 |
Pages of publication | 10289 - 10296 |
a | 8.1809 ± 0.0016 Å |
b | 22.356 ± 0.005 Å |
c | 17.634 ± 0.004 Å |
α | 90° |
β | 94.57 ± 0.03° |
γ | 90° |
Cell volume | 3214.9 ± 1.2 Å3 |
Cell temperature | 293 ± 2 K |
Ambient diffraction temperature | 293 ± 2 K |
Number of distinct elements | 4 |
Space group number | 9 |
Hermann-Mauguin space group symbol | C 1 c 1 |
Hall space group symbol | C -2yc |
Residual factor for all reflections | 0.0792 |
Residual factor for significantly intense reflections | 0.0545 |
Weighted residual factors for significantly intense reflections | 0.09 |
Weighted residual factors for all reflections included in the refinement | 0.0971 |
Goodness-of-fit parameter for all reflections included in the refinement | 1.053 |
Diffraction radiation wavelength | 0.71075 Å |
Diffraction radiation type | MoKα |