Information card for entry 7035086
Formula | C56 H76 N4 O8 Pd Ti3 |
Calculated formula | C42 H60 N4 O8 Pd Ti3 |
Title of publication | Heterometallic complexes with cube-type [MTi3N4] cores containing Group 10 metals in a variety of oxidation states. |
Authors of publication | Martínez-Espada, Noelia; Mena, Miguel; Pérez-Redondo, Adrián; Varela-Izquierdo, Víctor; Yélamos, Carlos |
Journal of publication | Dalton transactions (Cambridge, England : 2003) |
Year of publication | 2015 |
Journal volume | 44 |
Journal issue | 21 |
Pages of publication | 9782 - 9794 |
a | 18.795 ± 0.006 Å |
b | 11.323 ± 0.003 Å |
c | 27.184 ± 0.006 Å |
α | 90° |
β | 105.25 ± 0.02° |
γ | 90° |
Cell volume | 5581 ± 3 Å3 |
Cell temperature | 200 ± 2 K |
Ambient diffraction temperature | 200 ± 2 K |
Number of distinct elements | 6 |
Space group number | 14 |
Hermann-Mauguin space group symbol | P 1 21/n 1 |
Hall space group symbol | -P 2yn |
Residual factor for all reflections | 0.1576 |
Residual factor for significantly intense reflections | 0.0794 |
Weighted residual factors for significantly intense reflections | 0.1947 |
Weighted residual factors for all reflections included in the refinement | 0.2243 |
Goodness-of-fit parameter for all reflections included in the refinement | 0.948 |
Diffraction radiation probe | x-ray |
Diffraction radiation wavelength | 0.71073 Å |
Diffraction radiation type | MoKα |