Information card for entry 7035090
Formula | C76 H65 B2 N7 |
Calculated formula | C76 H65 B2 N7 |
SMILES | N1(C(=NC(=[N]([B]1(c1ccccc1)c1ccccc1)c1ccc(cc1)C)c1ccccc1)c1cccc(c1)C1=[N]([B](N(C(=N1)c1ccccc1)c1ccc(cc1)C)(c1ccccc1)c1ccccc1)c1ccc(cc1)C)c1ccc(cc1)C.C(#N)C |
Title of publication | Fluorescent benzene-centered mono-, bis- and tris-triazapentadiene-boron complexes. |
Authors of publication | Glotzbach, Christoph; Gödeke, Nadine; Fröhlich, Roland; Daniliuc, Constantin-Gabriel; Saito, Shohei; Yamaguchi, Shigehiro; Würthwein, Ernst-Ulrich |
Journal of publication | Dalton transactions (Cambridge, England : 2003) |
Year of publication | 2015 |
Journal volume | 44 |
Journal issue | 20 |
Pages of publication | 9659 - 9671 |
a | 19.1756 ± 0.0003 Å |
b | 10.4129 ± 0.0002 Å |
c | 30.597 ± 0.0005 Å |
α | 90° |
β | 96.906 ± 0.001° |
γ | 90° |
Cell volume | 6065.09 ± 0.18 Å3 |
Cell temperature | 223 ± 2 K |
Ambient diffraction temperature | 223 ± 2 K |
Number of distinct elements | 4 |
Space group number | 14 |
Hermann-Mauguin space group symbol | P 1 21/c 1 |
Hall space group symbol | -P 2ybc |
Residual factor for all reflections | 0.0977 |
Residual factor for significantly intense reflections | 0.0629 |
Weighted residual factors for significantly intense reflections | 0.1334 |
Weighted residual factors for all reflections included in the refinement | 0.1531 |
Goodness-of-fit parameter for all reflections included in the refinement | 1.056 |
Diffraction radiation wavelength | 0.71073 Å |
Diffraction radiation type | MoKα |