Information card for entry 7035095
Formula | C28 H22 Cl0 Co F6 N7 O0 P |
Calculated formula | C28 H22 Co F6 N7 P |
Title of publication | Counter anion dependent gradual spin transition in a 1D cobalt(ii) coordination polymer. |
Authors of publication | Roy, Subhasis; Choubey, Somnath; Bhar, Kishalay; Sikdar, Nivedita; Costa, José Sánchez; Mitra, Partha; Ghosh, Barindra Kumar |
Journal of publication | Dalton transactions (Cambridge, England : 2003) |
Year of publication | 2015 |
Journal volume | 44 |
Journal issue | 17 |
Pages of publication | 7774 - 7776 |
a | 15.3203 ± 0.0012 Å |
b | 8.6991 ± 0.0006 Å |
c | 21.59 ± 0.0017 Å |
α | 90° |
β | 90.555 ± 0.003° |
γ | 90° |
Cell volume | 2877.2 ± 0.4 Å3 |
Cell temperature | 298 ± 2 K |
Ambient diffraction temperature | 298 ± 2 K |
Number of distinct elements | 8 |
Space group number | 14 |
Hermann-Mauguin space group symbol | P 1 21/c 1 |
Hall space group symbol | -P 2ybc |
Residual factor for all reflections | 0.0934 |
Residual factor for significantly intense reflections | 0.0755 |
Weighted residual factors for significantly intense reflections | 0.1977 |
Weighted residual factors for all reflections included in the refinement | 0.2096 |
Goodness-of-fit parameter for all reflections included in the refinement | 1.095 |
Diffraction radiation wavelength | 0.71073 Å |
Diffraction radiation type | MoKα |