Information card for entry 7035101
Formula | C81 H99 Eu N7 O42 Tb3 |
Calculated formula | C81 H93 Eu3 N7 O42 Tb |
Title of publication | Multifunctional luminescence properties of co-doped lanthanide metal organic frameworks. |
Authors of publication | Xing, Shanghua; Zeng, Guang; Liu, Xiaomin; Yang, Fen; Hao, Zhiqiang; Gao, Wei; Yang, Yulin; Wang, Xiuru; Li, Guanghua; Shi, Zhan; Feng, Shouhua |
Journal of publication | Dalton transactions (Cambridge, England : 2003) |
Year of publication | 2015 |
Journal volume | 44 |
Journal issue | 20 |
Pages of publication | 9588 - 9595 |
a | 13.029 ± 0.003 Å |
b | 13.828 ± 0.003 Å |
c | 28.021 ± 0.006 Å |
α | 75.72 ± 0.03° |
β | 79.23 ± 0.03° |
γ | 85.59 ± 0.03° |
Cell volume | 4804 ± 2 Å3 |
Cell temperature | 293 ± 2 K |
Ambient diffraction temperature | 293 ± 2 K |
Number of distinct elements | 6 |
Space group number | 2 |
Hermann-Mauguin space group symbol | P -1 |
Hall space group symbol | -P 1 |
Residual factor for all reflections | 0.0557 |
Residual factor for significantly intense reflections | 0.0393 |
Weighted residual factors for significantly intense reflections | 0.1087 |
Weighted residual factors for all reflections included in the refinement | 0.1155 |
Goodness-of-fit parameter for all reflections included in the refinement | 1.093 |
Diffraction radiation wavelength | 0.71073 Å |
Diffraction radiation type | MoKα |