Information card for entry 7035103
Chemical name | 4-(3,5-dimethyl-1H-pyrazol-4-yl)benzoic acid |
Formula | C12 H12 N2 O2 |
Calculated formula | C12 H12 N2 O2 |
SMILES | O=C(O)c1ccc(c2c(n[nH]c2C)C)cc1 |
Title of publication | The synthesis and characterisation of coordination and hydrogen-bonded networks based on 4-(3,5-dimethyl-1H-pyrazol-4-yl)benzoic acid. |
Authors of publication | Bryant, Macguire R.; Burrows, Andrew D.; Fitchett, Christopher M.; Hawes, Chris S.; Hunter, Sally O.; Keenan, Luke L.; Kelly, David J.; Kruger, Paul E.; Mahon, Mary F.; Richardson, Christopher |
Journal of publication | Dalton transactions (Cambridge, England : 2003) |
Year of publication | 2015 |
Journal volume | 44 |
Journal issue | 19 |
Pages of publication | 9269 - 9280 |
a | 9.6538 ± 0.0005 Å |
b | 10.4193 ± 0.0006 Å |
c | 21.9388 ± 0.0014 Å |
α | 91.284 ± 0.004° |
β | 101.971 ± 0.004° |
γ | 102.808 ± 0.004° |
Cell volume | 2099.6 ± 0.2 Å3 |
Cell temperature | 123 ± 2 K |
Ambient diffraction temperature | 123 ± 2 K |
Number of distinct elements | 4 |
Space group number | 2 |
Hermann-Mauguin space group symbol | P -1 |
Hall space group symbol | -P 1 |
Residual factor for all reflections | 0.1326 |
Residual factor for significantly intense reflections | 0.054 |
Weighted residual factors for significantly intense reflections | 0.1007 |
Weighted residual factors for all reflections included in the refinement | 0.1305 |
Goodness-of-fit parameter for all reflections included in the refinement | 0.937 |
Diffraction radiation probe | x-ray |
Diffraction radiation wavelength | 0.71073 Å |
Diffraction radiation type | MoKα |