Information card for entry 7035106
Formula | C50 H53 N8 O10.5 Zn2 |
Calculated formula | C50 H53 N8 O10.5 Zn2 |
Title of publication | The synthesis and characterisation of coordination and hydrogen-bonded networks based on 4-(3,5-dimethyl-1H-pyrazol-4-yl)benzoic acid. |
Authors of publication | Bryant, Macguire R.; Burrows, Andrew D.; Fitchett, Christopher M.; Hawes, Chris S.; Hunter, Sally O.; Keenan, Luke L.; Kelly, David J.; Kruger, Paul E.; Mahon, Mary F.; Richardson, Christopher |
Journal of publication | Dalton transactions (Cambridge, England : 2003) |
Year of publication | 2015 |
Journal volume | 44 |
Journal issue | 19 |
Pages of publication | 9269 - 9280 |
a | 22.3458 ± 0.0007 Å |
b | 29.7691 ± 0.0011 Å |
c | 33.3734 ± 0.0011 Å |
α | 90° |
β | 90° |
γ | 90° |
Cell volume | 22200.5 ± 1.3 Å3 |
Cell temperature | 100 ± 0.1 K |
Ambient diffraction temperature | 100 ± 0.1 K |
Number of distinct elements | 5 |
Space group number | 43 |
Hermann-Mauguin space group symbol | F d d 2 |
Hall space group symbol | F 2 -2d |
Residual factor for all reflections | 0.0824 |
Residual factor for significantly intense reflections | 0.0763 |
Weighted residual factors for significantly intense reflections | 0.2192 |
Weighted residual factors for all reflections included in the refinement | 0.2287 |
Goodness-of-fit parameter for all reflections included in the refinement | 1.039 |
Diffraction radiation probe | x-ray |
Diffraction radiation wavelength | 1.54184 Å |
Diffraction radiation type | CuKα |